{"text_format":"3","workbook":"xlsx","n_sheets":7,"sheets":["Introduction and outcomes","Checklist","Dashboard","Optional - input raw data","RAG rating data for your school","RAG rating data for all schools","Calcs"],"not_rendered":{"macros":1,"external_links":4,"defined_names":97},"read":"whole","date_system":"1900"}

{"sheet":"Introduction and outcomes","index":0,"n_rows":21,"n_cols":15,"rows_kept":21,"merged":[[2,2,2,19],[4,2,4,19],[5,2,5,19],[6,2,6,19],[9,2,9,19],[11,2,11,19],[12,2,12,19],[14,2,14,10],[14,11,14,13],[14,14,14,18],[16,2,16,10],[16,11,16,13],[18,2,18,10],[18,11,18,13],[20,2,20,10],[20,11,20,13],[22,2,22,9]]}
[]
[]
[null,null,"Introduction to the schools financial value standard (SFVS)"]
[]
[null,null,"The schools financial value standard helps to provide schools with assurance that they are meeting the basic standards necessary to achieve a good level of financial health and resource management. \n\nThe tool can be used to identify possible areas for change to ensure that resources are being used to support high-quality teaching and the best education outcomes for pupils. The tool is in two parts:"]
[null,null,"1. A checklist, which asks a number of questions of governing bodies in six areas of resource management to provide assurance that the school is managing its resources effectively."]
[null,null,"2. A dashboard, which shows how a school's data compares to thresholds on a range of statistics that have been identified as indicators for good resource management and outcomes."]
[]
[]
[null,null,"Outcome of schools financial value standard (SFVS)"]
[]
[null,null,"Summary of agreed action and timetable for reporting back:"]
[]
[]
[null,null,"Signature:",{"$nulls":11},"Chair of governing body / management committee"]
[]
[null,null,"Full name of signatory:"]
[]
[null,null,"Date SFVS agreed by full governing body / managament committee"]
[]
{"$rows_left_out":2}
{"sheet":"Checklist","index":1,"n_rows":62,"n_cols":15,"rows_kept":62,"merged":[[2,2,2,20],[4,2,4,20],[5,2,5,20],[6,2,6,20],[8,2,9,6],[8,7,9,20],[10,2,10,6],[10,7,10,20],[12,14,12,20],[13,2,13,20],[15,3,15,9],[15,14,15,20],[16,3,16,9],[16,14,16,20],[17,3,17,9],[17,14,17,20],[18,3,18,9],[18,14,18,20],[19,3,19,9],[19,14,19,20],[21,2,21,20],[23,3,23,9],[23,14,23,20],[24,3,24,9],[24,14,24,20],[25,3,25,9],[25,14,25,20],[27,2,27,20],[29,3,29,9],[29,14,29,20],[30,3,30,9],[30,14,30,20],[31,3,31,9],[31,14,31,20],[32,3,32,9],[32,14,32,20],[33,3,33,9],[33,14,33,20],[35,2,35,20],[37,3,37,9],[37,14,37,20],[38,3,38,9],[38,14,38,20],[39,3,39,9],[39,14,39,20],[41,2,41,20],[43,3,43,9],[43,14,43,20],[44,3,44,9],[44,14,44,20],[45,3,45,9],[45,14,45,20],[46,3,46,9],[46,14,46,20],[47,3,47,9],[47,14,47,20],[48,3,48,9],[48,14,48,20],[50,2,50,20],[52,3,52,9],[52,14,52,20],[53,3,53,9],[53,14,53,20],[54,3,54,9],[54,14,54,20],[55,3,55,9],[55,14,55,20],[56,3,56,9],[56,14,56,20],[57,3,57,9],[57,14,57,20],[59,2,59,20],[61,3,61,9],[61,14,61,20],[63,2,63,9]]}
[]
[]
[null,null,"Schools financial value standard"]
[]
[null,null,"The checklist asks a number of questions of governing bodies in six areas of resource management to help provide assurance that resources are being managed effectively. \n\nThe completion of this assessment forms part of the schools financial value standard. Your return must be submitted to your local authority."]
[null,null,"Guidance on completion of this document can be found here. This guidance also includes examples of good practice and details further support available to assist governing bodies in addressing specific issues. Clicking on the individual questions below will also take you to the relevant section of the guidance."]
[null,null,"Schools should answer each question with 'yes', 'no', or 'in part' from the drop down lists provided. They should provide comments, evidence and proposed actions for questions as appropriate."]
[]
[null,null,"School name:",{"$nulls":4},"The Richmond School, Skegness"]
[]
[null,null,"School LAEstab number:",{"$nulls":4},"925/2219"]
[]
[{"$nulls":12},"Answer",null,"Comments, evidence and proposed actions"]
[null,null,"A. Governance"]
[]
[null,null,1,"In the view of the governing body and senior staff, does the governing body have adequate financial skills among its members to fulfil its role of challenge and support in the field of budget management and value for money?",{"$nulls":6},"Q1 guidance",null,"Yes",null,"The governing body has members experienced in budget management and is made up of skilled professionals. The governing body needs to ensure that any new governor has financial experience or is provided with the relevant training."]
[null,null,2,"Does the governing body have a finance committee (or equivalent) with clear terms of reference and a knowledgeable and experienced chair?",{"$nulls":6},"Q2 guidance",null,"Yes",null,"The governing body has an experienced Finance Committee with clear terms of reference. The chair is experienced."]
[null,null,3,"Does the governing body board receive clear and concise monitoring reports of the school's budget position at least six times a year?",{"$nulls":6},"Q3 guidance",null,"Yes",null,"Finance meetings are held six times per year with a  financial overview presented at the meetings of the full Governing Body."]
[null,null,4,"Are business interests of governing body members and staff properly registered and taken into account so as to avoid conflicts of interest?",{"$nulls":6},"Q4 guidance",null,"Yes",null,"All governors and staff complete a register of business interests. This is published on the school's website. It is an agenda item at every Full Governors' Meeting"]
[null,null,5,"Does the school have access to an adequate level of financial expertise, including when specialist finance staff are absent, e.g. on sick leave?",{"$nulls":6},"Q5 guidance",null,"Yes",null,"The School Bursar, School Administrator and Head Teacher have all received relevant training. Support is accessed regularly from the Helpdesk and from the school's involvement in the Gold Finance package."]
{"$rows_left_out":43}
{"sheet":"Dashboard","index":2,"n_rows":65,"n_cols":9,"rows_kept":65,"merged":[[2,2,2,8],[4,2,4,8],[6,2,6,8],[7,2,7,8],[8,2,8,8],[10,2,10,8],[12,2,12,4],[14,5,14,8],[16,5,18,8],[22,2,22,4],[23,2,23,3],[24,2,24,3],[25,6,26,6],[25,8,26,8],[27,2,27,4],[29,2,29,3],[30,2,30,3],[31,2,31,3],[32,2,32,3],[33,2,33,3],[34,2,34,3],[35,2,35,3],[36,2,36,3],[37,2,37,3],[39,2,39,4],[41,2,41,3],[42,2,42,3],[44,2,44,4],[46,2,46,3],[47,2,47,3],[48,2,48,3],[49,2,49,3],[50,2,50,3],[51,2,51,3],[52,2,52,3],[54,2,54,4],[56,2,56,3],[57,2,57,3],[58,2,58,3],[59,2,59,3],[60,2,60,3],[62,2,62,4],[64,2,70,8]]}
[]
[]
[null,null,"Schools financial value standard - dashboard"]
[]
[null,null,"Effective resource management is about how a school uses its resources to drive outcomes for its pupils. A school can improve outcomes by using its resources more effectively.\n \nThe dashboard below is designed to help schools identify areas for improved resource management. It shows how a school compares to thresholds on a range of key indicators. \n\nThe completion of this assessment forms part of the annual schools financial value standard."]
[]
[null,null,"\nUsing the dashboard\n\nSchools should use the most up to date data available to them, and not rely on lagged published data.\n \nComplete all highlighted cells."]
[null,null,"Guidance on calculating or collecting the data for the school so that metrics are compared to thresholds consistently can be found here. Clicking on the link next to individual indicators below will also take you to the relevant section of the guidance."]
[null,null,"Either input the school's percentages and ratios directly, or complete the Optional - input raw data form with spending information and school characteristics. The percentages and ratios in the dashboard will then auto-calculate."]
[]
[null,null,"Using the results from the dashboard\n\nClick here for explanations of what the red, amber and green (RAG) ratings mean and what do with the results."]
[]
[null,null,"A. Information about your school"]
["*",{"$nulls":5},1]
[null,null,"School name:","The Richmond School, Skegness",null,"Click here to see the RAG rating data for this school"]
[null,null,"School LAEstab number:",9252219]
[null,null,"Phase:","Primary",null,"Input the school's percentages and ratios directly below, or\nclick here to input raw spending and characteristics data for your school"]
[null,null,"Region:","East Midlands"]
[null,null,"Number of pupils:",420]
[null,null,"% of pupils eligible for FSM:",{"v":0.33,"d":"33.0%"}]
{"$rows_left_out":46}
{"sheet":"Optional - input raw data","index":3,"n_rows":55,"n_cols":6,"rows_kept":55,"merged":[[2,2,2,3],[4,2,4,5],[5,2,5,5],[8,2,8,3],[9,2,9,3],[10,2,10,3],[12,2,12,3],[13,2,13,3],[14,2,14,3],[16,2,16,3],[17,2,17,3],[18,2,18,3],[20,2,20,3],[21,2,21,3]]}
[]
[]
[null,null,"Raw data form"]
[{"$nulls":5},1]
[null,null,"This form can be used to input raw spend and characteristics information. If used, the information in this table will be used to calculate the percentages and ratios required in the dashboard. Alternatively, \nclick here to input the percentages and ratios directly into the dashboard."]
[null,null,"Schools should use the most up to date information available to them, and not rely on lagged published data.\n\nAll of the data should refer to the same financial year."]
[]
[]
[null,null,"Full time equivalent number of teachers (classroom and leadership)",null,null,16.7]
[null,null,"Full time equivalent of teachers in the leadership group",null,null,4.5]
[null,null,"Full time equivalent of total school workforce",null,null,50.4]
[]
[null,null,"Total expenditure",null,null,{"v":1919552,"d":"£1,919,552"}]
[null,null,"Total income",null,null,{"v":1967396,"d":"£1,967,396"}]
[null,null,"Revenue balances (committed and uncommitted)"]
[]
[null,null,"For secondary and all-through schools:"]
[null,null,"Teaching periods in the timetable cycle"]
[null,null,"Total lessons taught by all teachers in the timetable cycle"]
[{"$nulls":5},{"$f":"IFERROR(IF((F19/(F18*F9))<0.5,\"Resulting teacher contact ratio is low. Total lessons taught may be incorrectly calculated as too low\",IF((F19/(F18*F9))>1,\"Resulting teacher contact ratio is greater than 1. Total lessons taught is too high\",\"\")),\"\")","v":""}]
{"$rows_left_out":36}
{"sheet":"RAG rating data for your school","index":4,"n_rows":99,"n_cols":20,"rows_kept":99,"merged":[[1,7,14,19],[18,3,18,4],[18,6,18,9],[18,11,18,14],[18,16,18,19],[20,1,21,1],[23,1,24,1],[26,1,27,1],[29,1,30,1],[32,1,33,1],[35,1,36,1],[38,1,39,1],[41,1,42,1],[47,3,47,4],[47,6,47,9],[47,11,47,14],[47,16,47,19],[49,1,50,1],[52,1,53,1],[58,3,58,4],[58,6,58,9],[58,11,58,14],[58,16,58,19],[60,1,61,1],[63,1,64,1],[66,1,67,1],[69,1,70,1],[72,1,73,1],[75,1,76,1],[78,1,79,1],[84,3,84,4],[84,6,84,9],[84,11,84,14],[84,16,84,19],[86,1,87,1],[89,1,90,1],[92,1,93,1],[95,1,96,1],[98,1,99,1]]}
[]
[null,"Your school has been identified as:",{"$nulls":5},"The RAG ratings have been calculated using maintained school and academy 2017 to 18 data.\n\nThe majority of metrics in the dashboard are percentages and ratios which at a national level don't change significantly year on year, so they still provide a fair and useful comparison with your up to date data.\n\nHowever, to reflect pay awards and pension contributions changes, the underlying data on teaching staff spending and average teacher costs have been adjusted. The RAG ratings for spend on teaching staff as a percentage of total expenditure and average teacher costs include uplifts relating to the year you have selected. \n\n2017-18 : no uplift\n2018-19 : 1.4% uplift to reflect the September 2018 pay award\n2019-20 : 7.5% to also reflect the September 2019 pay award and September 2019 pensions contributions changes\n2019/20 : 11.2% to reflect the September 2019 pay award and September 2019 pensions contributions changes"]
[null,{"$f":"IF(Dashboard!D15=\"\",\"\",\"- \"&\nINDEX(Calcs!L:L,MATCH(Dashboard!D15,Calcs!A:A,0)))","v":"- a primary school"}]
[null,{"$f":"IF(Dashboard!D15=\"\",\"\",\"- \"&\nINDEX(Calcs!I:I,MATCH(Dashboard!D15,Calcs!A:A,0)))","v":"- outside London"}]
[null,{"$f":"IF(Dashboard!D15=\"\",\"\",\nIF(OR($B$3=\"- an alternative provision school\",$B$3=\"- a special school\",$B$3=\"- an all-through school\",$B$3=\"- a nursery school\"),\"\",\n\"- a \"&INDEX(Calcs!J:J,MATCH(Dashboard!D15,Calcs!A:A,0))&\" school because it has \"&INDEX(Calcs!M:M,MATCH(Dashboard!D15,Calcs!A:A,0))))","v":"- a large school because it has more than 385 pupils"}]
[null,{"$f":"IF(Dashboard!D15=\"\",\"\",\nIF(OR($B$3=\"- an alternative provision school\",$B$3=\"- a special school\",$B$3=\"- an all-through school\",$B$3=\"- a nursery school\"),\"\",\n\"- a school with \"&INDEX(Calcs!K:K,MATCH(Dashboard!D15,Calcs!A:A,0))&\" because \"&INDEX(Calcs!N:N,MATCH(Dashboard!D15,Calcs!A:A,0))&\" are eligible\"))","v":"- a school with high levels of FSM because more than 18% of pupils are eligible"}]
[]
[null,{"$f":"IF(Dashboard!D21=\"\",\"\",\"You have identified your data as \"&INDEX(Calcs!O:O,MATCH(Dashboard!D15,Calcs!A:A,0)))","v":"You have identified your data as 2019-20 (financial year)"}]
[]
[]
[]
[]
[]
[]
[null,"The thresholds for the RAG ratings are based on these characteristics and are:"]
[]
[null,"B. Your spending as a percentage of expenditure"]
[]
[{"$nulls":3},"Red rating",null,null,"Amber rating",{"$nulls":4},"Light green rating",{"$nulls":4},"Dark green rating"]
[]
{"$rows_left_out":80}
{"sheet":"RAG rating data for all schools","index":5,"n_rows":715,"n_cols":14,"rows_kept":715,"merged":[[516,3,516,4],[679,3,679,4]]}
[null,"Expand the groups to see the thresholds"]
[]
["Sample size","Phase","Size","FSM",null,"Red if less than:","Amber if less than:","Dark green if between:","(Median)","and:","Amber if more than:","Red if more than:",null,"Light green for everything else"]
[726,"Primary","Very small","Low FSM","PVSL"]
[null,"Primary","Very small","Low FSM","Spend on teaching staff as a percentage of total expenditure - 2017-18",{"v":0.395,"d":"39.5%"},{"v":0.42,"d":"42.0%"},{"v":0.455,"d":"45.5%"},{"v":0.47,"d":"47.0%"},{"v":0.485,"d":"48.5%"},{"v":0.515,"d":"51.5%"},{"v":0.54,"d":"54.0%"}]
[null,"Primary","Very small","Low FSM","Spend on teaching staff as a percentage of total expenditure - 2018-19",{"v":0.4,"d":"40.0%"},{"v":0.425,"d":"42.5%"},{"v":0.46,"d":"46.0%"},{"v":0.475,"d":"47.5%"},{"v":0.485,"d":"48.5%"},{"v":0.52,"d":"52.0%"},{"v":0.54,"d":"54.0%"}]
[null,"Primary","Very small","Low FSM","Spend on teaching staff as a percentage of total expenditure - 2019-20",{"v":0.415,"d":"41.5%"},{"v":0.44,"d":"44.0%"},{"v":0.475,"d":"47.5%"},{"v":0.49,"d":"49.0%"},{"v":0.5,"d":"50.0%"},{"v":0.535,"d":"53.5%"},{"v":0.555,"d":"55.5%"}]
[null,"Primary","Very small","Low FSM","Spend on teaching staff as a percentage of total expenditure - 2019/20",{"v":0.42,"d":"42.0%"},{"v":0.45,"d":"45.0%"},{"v":0.48,"d":"48.0%"},{"v":0.495,"d":"49.5%"},{"v":0.51,"d":"51.0%"},{"v":0.545,"d":"54.5%"},{"v":0.565,"d":"56.5%"}]
[null,"Primary","Very small","Low FSM","Spend on supply staff as a percentage of total expenditure",null,null,{"v":0.02,"d":"2.0%"},{"v":0.02,"d":"2.0%"},{"v":0.025,"d":"2.5%"},{"v":0.04,"d":"4.0%"},{"v":0.055,"d":"5.5%"}]
[null,"Primary","Very small","Low FSM","Spend on education support staff as a percentage of total expenditure",null,null,{"v":0.125,"d":"12.5%"},{"v":0.13,"d":"13.0%"},{"v":0.145,"d":"14.5%"},{"v":0.17,"d":"17.0%"},{"v":0.19,"d":"19.0%"}]
[null,"Primary","Very small","Low FSM","Spend on administrative and clerical staff as a percentage of total expenditure",{"$nulls":3},{"v":0.055,"d":"5.5%"},null,{"v":0.075,"d":"7.5%"},{"v":0.085,"d":"8.5%"}]
[null,"Primary","Very small","Low FSM","Spend on other staff costs as a percentage of total expenditure",{"$nulls":3},{"v":0.03,"d":"3.0%"},null,{"v":0.05,"d":"5.0%"},{"v":0.065,"d":"6.5%"}]
[null,"Primary","Very small","Low FSM","Spend on premises (including staff costs) as a percentage of total expenditure",{"$nulls":3},{"v":0.05,"d":"5.0%"},null,{"v":0.065,"d":"6.5%"},{"v":0.08,"d":"8.0%"}]
[null,"Primary","Very small","Low FSM","Spend on teaching resources as a percentage of total expenditure",{"v":0.03,"d":"3.0%"},{"v":0.04,"d":"4.0%"},{"v":0.05,"d":"5.0%"},{"v":0.055,"d":"5.5%"},{"v":0.065,"d":"6.5%"}]
[null,"Primary","Very small","Low FSM","Spend on energy as a percentage of total expenditure",{"$nulls":3},{"v":0.01,"d":"1.0%"},null,{"v":0.015,"d":"1.5%"},{"v":0.02,"d":"2.0%"}]
[null,"Primary","Very small","Low FSM","Senior leaders as a percentage of workforce",null,null,{"v":0.115,"d":"11.5%"},{"v":0.125,"d":"12.5%"},{"v":0.14,"d":"14.0%"},{"v":0.175,"d":"17.5%"},{"v":0.215,"d":"21.5%"}]
[null,"Primary","Very small","Low FSM","Pupil to teacher ratio",{"v":12,"d":"12.0"},{"v":14,"d":"14.0"},{"v":16,"d":"16.0"},{"v":17,"d":"17.0"},{"v":18,"d":"18.0"},{"v":20,"d":"20.0"},22.5]
[null,"Primary","Very small","Low FSM","Pupil to adult ratio",{"v":6,"d":"6.0"},{"v":7,"d":"7.0"},{"v":8,"d":"8.0"},8.5,{"v":9,"d":"9.0"},{"v":10,"d":"10.0"},{"v":11,"d":"11.0"}]
[null,"Primary","Very small","Low FSM","Average class size",{"v":14,"d":"14.0"},{"v":17,"d":"17.0"},20.5,{"v":21,"d":"21.0"},22.5,24.5,{"v":26,"d":"26.0"}]
[]
{"$rows_left_out":696}
{"sheet":"Calcs","index":6,"n_rows":66,"n_cols":27,"rows_kept":66,"hidden":true}
[]
["RAG ratings for each school"]
[]
[null,null,1,{"$nulls":11},"2017-18 (financial year)"]
[null,null,{"$f":"IF(Dashboard!D17=\"Primary\",\"P\",IF(Dashboard!D17=\"Secondary with sixth form\",\"SS\",IF(Dashboard!D17=\"Secondary without sixth form\",\"S\",IF(Dashboard!D17=\"Special\",\"SP\",IF(Dashboard!D17=\"Alternative provision\",\"AP\",IF(Dashboard!D17=\"All-through\",\"AT\",IF(Dashboard!D17=\"Nursery\",\"N\")))))))","v":"P"},{"$nulls":11},"2018-19 (financial year)"]
[null,null,{"$f":"C5&\nIF($J29=\"very small\",\"VS\",IF($J29=\"small\",\"S\",IF($J29=\"medium\",\"M\",IF($J29=\"large\",\"L\"))))&\nIF($K29=\"low levels of FSM\",\"L\",IF($K29=\"medium levels of FSM\",\"M\",IF($K29=\"high levels of FSM\",\"H\")))","v":"PLH"},{"$nulls":11},"2019-20 (financial year)"]
[null,null,{"$f":"C5&\nIF(AND(C5=\"SS\",$I29=\"in London\"),\"Lo\",IF($I29=\"in London\",\"L\",IF($I29=\"outside London\",\"NL\")))","v":"PNL"},{"$nulls":11},"2019/20 (academic year) or later"]
[null,null,1,2,3,4,5,6,7]
["Spend on teaching staff as a percentage of total expenditure",{"$f":"IF(Dashboard!D21=O4,1,IF(Dashboard!D21=O5,2,IF(Dashboard!D21=O6,3,IF(Dashboard!D21=O7,4))))","v":3},{"$f":"IF(OR($C$5=\"P\",$C$5=\"SS\",$C$5=\"S\"),INDEX(INDIRECT($C$6),$B9,C$8),\nIF(OR($C$5=\"N\",$C$5=\"AP\",$C$5=\"AT\",$C$5=\"SP\"),INDEX(INDIRECT($C$7),$B9,C$8)))","v":{"v":0.37,"d":"37.0%"}},{"v":0.395,"d":"39.5%"},{"v":0.43,"d":"43.0%"},{"v":0.44,"d":"44.0%"},{"v":0.455,"d":"45.5%"},{"v":0.485,"d":"48.5%"},{"v":0.51,"d":"51.0%"}]
["Spend on supply staff as a percentage of total expenditure",5,null,null,{"$f":"IF(OR($C$5=\"P\",$C$5=\"SS\",$C$5=\"S\"),INDEX(INDIRECT($C$6),$B10,E$8),\nIF(OR($C$5=\"N\",$C$5=\"AP\",$C$5=\"AT\",$C$5=\"SP\"),INDEX(INDIRECT($C$7),$B10,E$8)))","v":{"v":0.02,"d":"2.0%"}},{"v":0.025,"d":"2.5%"},{"v":0.03,"d":"3.0%"},{"v":0.045,"d":"4.5%"},{"v":0.06,"d":"6.0%"}]
["Spend on education support staff as a percentage of total expenditure",6,null,null,{"v":0.195,"d":"19.5%"},{"v":0.205,"d":"20.5%"},{"v":0.22,"d":"22.0%"},{"v":0.25,"d":"25.0%"},{"v":0.265,"d":"26.5%"}]
["Spend on administrative and clerical staff as a percentage of total expenditure",7,{"$nulls":3},{"$f":"IF(OR($C$5=\"P\",$C$5=\"SS\",$C$5=\"S\"),INDEX(INDIRECT($C$6),$B12,F$8),\nIF(OR($C$5=\"N\",$C$5=\"AP\",$C$5=\"AT\",$C$5=\"SP\"),INDEX(INDIRECT($C$7),$B12,F$8)))","v":{"v":0.045,"d":"4.5%"}},null,{"$f":"IF(OR($C$5=\"P\",$C$5=\"SS\",$C$5=\"S\"),INDEX(INDIRECT($C$6),$B12,H$8),\nIF(OR($C$5=\"N\",$C$5=\"AP\",$C$5=\"AT\",$C$5=\"SP\"),INDEX(INDIRECT($C$7),$B12,H$8)))","v":{"v":0.06,"d":"6.0%"}},{"$f":"IF(OR($C$5=\"P\",$C$5=\"SS\",$C$5=\"S\"),INDEX(INDIRECT($C$6),$B12,I$8),\nIF(OR($C$5=\"N\",$C$5=\"AP\",$C$5=\"AT\",$C$5=\"SP\"),INDEX(INDIRECT($C$7),$B12,I$8)))","v":{"v":0.075,"d":"7.5%"}}]
["Spend on other staff costs as a percentage of total expenditure",8,{"$nulls":3},{"v":0.035,"d":"3.5%"},null,{"$f":"IF(OR($C$5=\"P\",$C$5=\"SS\",$C$5=\"S\"),INDEX(INDIRECT($C$6),$B13,H$8),\nIF(OR($C$5=\"N\",$C$5=\"AP\",$C$5=\"AT\",$C$5=\"SP\"),INDEX(INDIRECT($C$7),$B13,H$8)))","v":{"v":0.045,"d":"4.5%"}},{"$f":"IF(OR($C$5=\"P\",$C$5=\"SS\",$C$5=\"S\"),INDEX(INDIRECT($C$6),$B13,I$8),\nIF(OR($C$5=\"N\",$C$5=\"AP\",$C$5=\"AT\",$C$5=\"SP\"),INDEX(INDIRECT($C$7),$B13,I$8)))","v":{"v":0.06,"d":"6.0%"}}]
["Spend on premises (including staff costs) as a percentage of total expenditure",9,{"$nulls":3},{"v":0.05,"d":"5.0%"},null,{"$f":"IF(OR($C$5=\"P\",$C$5=\"SS\",$C$5=\"S\"),INDEX(INDIRECT($C$6),$B14,H$8),\nIF(OR($C$5=\"N\",$C$5=\"AP\",$C$5=\"AT\",$C$5=\"SP\"),INDEX(INDIRECT($C$7),$B14,H$8)))","v":{"v":0.07,"d":"7.0%"}},{"v":0.08,"d":"8.0%"}]
["Spend on teaching resources as a percentage of total expenditure",10,{"$f":"IF(OR($C$5=\"P\",$C$5=\"SS\",$C$5=\"S\"),INDEX(INDIRECT($C$6),$B15,C$8),\nIF(OR($C$5=\"N\",$C$5=\"AP\",$C$5=\"AT\",$C$5=\"SP\"),INDEX(INDIRECT($C$7),$B15,C$8)))","v":{"v":0.025,"d":"2.5%"}},{"$f":"IF(OR($C$5=\"P\",$C$5=\"SS\",$C$5=\"S\"),INDEX(INDIRECT($C$6),$B15,D$8),\nIF(OR($C$5=\"N\",$C$5=\"AP\",$C$5=\"AT\",$C$5=\"SP\"),INDEX(INDIRECT($C$7),$B15,D$8)))","v":{"v":0.03,"d":"3.0%"}},{"$f":"IF(OR($C$5=\"P\",$C$5=\"SS\",$C$5=\"S\"),INDEX(INDIRECT($C$6),$B15,E$8),\nIF(OR($C$5=\"N\",$C$5=\"AP\",$C$5=\"AT\",$C$5=\"SP\"),INDEX(INDIRECT($C$7),$B15,E$8)))","v":{"v":0.04,"d":"4.0%"}},{"$f":"IF(OR($C$5=\"P\",$C$5=\"SS\",$C$5=\"S\"),INDEX(INDIRECT($C$6),$B15,F$8),\nIF(OR($C$5=\"N\",$C$5=\"AP\",$C$5=\"AT\",$C$5=\"SP\"),INDEX(INDIRECT($C$7),$B15,F$8)))","v":{"v":0.045,"d":"4.5%"}},{"$f":"IF(OR($C$5=\"P\",$C$5=\"SS\",$C$5=\"S\"),INDEX(INDIRECT($C$6),$B15,G$8),\nIF(OR($C$5=\"N\",$C$5=\"AP\",$C$5=\"AT\",$C$5=\"SP\"),INDEX(INDIRECT($C$7),$B15,G$8)))","v":{"v":0.05,"d":"5.0%"}}]
["Spend on energy as a percentage of total expenditure",11,{"$nulls":3},{"v":0.01,"d":"1.0%"},null,{"v":0.015,"d":"1.5%"},{"v":0.02,"d":"2.0%"}]
["Senior leaders as a percentage of workforce",12,null,null,{"$f":"IF(OR($C$5=\"P\",$C$5=\"SS\",$C$5=\"S\"),INDEX(INDIRECT($C$6),$B17,E$8),\nIF(OR($C$5=\"N\",$C$5=\"AP\",$C$5=\"AT\",$C$5=\"SP\"),INDEX(INDIRECT($C$7),$B17,E$8)))","v":{"v":0.065,"d":"6.5%"}},{"v":0.07,"d":"7.0%"},{"$f":"IF(OR($C$5=\"P\",$C$5=\"SS\",$C$5=\"S\"),INDEX(INDIRECT($C$6),$B17,G$8),\nIF(OR($C$5=\"N\",$C$5=\"AP\",$C$5=\"AT\",$C$5=\"SP\"),INDEX(INDIRECT($C$7),$B17,G$8)))","v":{"v":0.075,"d":"7.5%"}},{"v":0.09,"d":"9.0%"},{"v":0.105,"d":"10.5%"}]
["Pupil to teacher ratio",13,{"$f":"IF(OR($C$5=\"P\",$C$5=\"SS\",$C$5=\"S\"),INDEX(INDIRECT($C$6),$B18,C$8),\nIF(OR($C$5=\"N\",$C$5=\"AP\",$C$5=\"AT\",$C$5=\"SP\"),INDEX(INDIRECT($C$7),$B18,C$8)))","v":{"v":17,"d":"17.0"}},{"$f":"IF(OR($C$5=\"P\",$C$5=\"SS\",$C$5=\"S\"),INDEX(INDIRECT($C$6),$B18,D$8),\nIF(OR($C$5=\"N\",$C$5=\"AP\",$C$5=\"AT\",$C$5=\"SP\"),INDEX(INDIRECT($C$7),$B18,D$8)))","v":{"v":18,"d":"18.0"}},{"$f":"IF(OR($C$5=\"P\",$C$5=\"SS\",$C$5=\"S\"),INDEX(INDIRECT($C$6),$B18,E$8),\nIF(OR($C$5=\"N\",$C$5=\"AP\",$C$5=\"AT\",$C$5=\"SP\"),INDEX(INDIRECT($C$7),$B18,E$8)))","v":{"v":20,"d":"20.0"}},20.5,{"$f":"IF(OR($C$5=\"P\",$C$5=\"SS\",$C$5=\"S\"),INDEX(INDIRECT($C$6),$B18,G$8),\nIF(OR($C$5=\"N\",$C$5=\"AP\",$C$5=\"AT\",$C$5=\"SP\"),INDEX(INDIRECT($C$7),$B18,G$8)))","v":{"v":21,"d":"21.0"}},{"v":23,"d":"23.0"},24.5]
["Pupil to adult ratio",14,{"$f":"IF(OR($C$5=\"P\",$C$5=\"SS\",$C$5=\"S\"),INDEX(INDIRECT($C$6),$B19,C$8),\nIF(OR($C$5=\"N\",$C$5=\"AP\",$C$5=\"AT\",$C$5=\"SP\"),INDEX(INDIRECT($C$7),$B19,C$8)))","v":{"v":7,"d":"7.0"}},{"$f":"IF(OR($C$5=\"P\",$C$5=\"SS\",$C$5=\"S\"),INDEX(INDIRECT($C$6),$B19,D$8),\nIF(OR($C$5=\"N\",$C$5=\"AP\",$C$5=\"AT\",$C$5=\"SP\"),INDEX(INDIRECT($C$7),$B19,D$8)))","v":7.5},{"$f":"IF(OR($C$5=\"P\",$C$5=\"SS\",$C$5=\"S\"),INDEX(INDIRECT($C$6),$B19,E$8),\nIF(OR($C$5=\"N\",$C$5=\"AP\",$C$5=\"AT\",$C$5=\"SP\"),INDEX(INDIRECT($C$7),$B19,E$8)))","v":{"v":8,"d":"8.0"}},8.5,{"$f":"IF(OR($C$5=\"P\",$C$5=\"SS\",$C$5=\"S\"),INDEX(INDIRECT($C$6),$B19,G$8),\nIF(OR($C$5=\"N\",$C$5=\"AP\",$C$5=\"AT\",$C$5=\"SP\"),INDEX(INDIRECT($C$7),$B19,G$8)))","v":{"v":9,"d":"9.0"}},9.5,10.5]
["Average class size",15,{"$f":"IF(OR($C$5=\"P\",$C$5=\"SS\",$C$5=\"S\"),INDEX(INDIRECT($C$6),$B20,C$8),\nIF(OR($C$5=\"N\",$C$5=\"AP\",$C$5=\"SP\"),\"\",IF($C$5=\"AT\",INDEX(INDIRECT($C$7),$B20,C$8))))","v":24.5},25.5,{"v":27,"d":"27.0"},27.5,{"v":28,"d":"28.0"},{"v":29,"d":"29.0"},29.5]
{"$rows_left_out":46}